Target
Histone-lysine N-methyltransferase EZH2 [A677G]
Ligand
BDBM190206
Substrate
Meas. Tech.
Inhibition Assay
IC50
2.8±n/a nM
Citation
 Kuntz, KWKnutson, SKWigle, TJ Inhibitors of human EZH2, and methods of use thereof US Patent  US9175331 Publication Date 11/3/2015 
Target
Name:
Histone-lysine N-methyltransferase EZH2 [A677G]
Synonyms:
EZH2 Histone-lysine N-methyltransferase EZH2 (A677G) | KMT6
Type:
Protein
Mol. Mass.:
85381.87
Organism:
Homo sapiens (Human)
Description:
Q15910[A677G]
Residue:
746
  
Inhibitor
Name:
BDBM190206
Synonyms:
EPZ008494 | US9175331, 37
Type:
Small organic molecule
Emp. Form.:
C28H41ClN4O2
Mol. Mass.:
501.104
SMILES:
CCCc1cc(C)[nH]c(=O)c1CNC(=O)c1cc(Cl)cc(N(CC)[C@H]2CC[C@@H](CC2)N(C)C)c1C
: