Target
Histone-lysine N-methyltransferase EZH2 [A687V]
Ligand
BDBM190202
Substrate
Meas. Tech.
Inhibition Assay
IC50
1.4±n/a nM
Citation
 Kuntz, KWKnutson, SKWigle, TJ Inhibitors of human EZH2, and methods of use thereof US Patent  US9175331 Publication Date 11/3/2015 
Target
Name:
Histone-lysine N-methyltransferase EZH2 [A687V]
Synonyms:
EZH2 Histone-lysine N-methyltransferase EZH2 (A687V) | KMT6
Type:
Protein
Mol. Mass.:
85395.90
Organism:
Homo sapiens (Human)
Description:
Q15910[A687V]
Residue:
746
  
Inhibitor
Name:
BDBM190202
Synonyms:
EPZ008337 | US9175331, 32
Type:
Small organic molecule
Emp. Form.:
C30H45N5O3
Mol. Mass.:
523.71
SMILES:
CCN(C1CCC(CC1)N(C)C)c1cc(OC2CN(C)C2)cc(C(=O)NCc2c(C)cc(C)[nH]c2=O)c1C
: