Target
Histone-lysine N-methyltransferase EZH2 [A687V]
Ligand
BDBM190207
Substrate
Meas. Tech.
Inhibition Assay
IC50
7.6±n/a nM
Citation
 Kuntz, KWKnutson, SKWigle, TJ Inhibitors of human EZH2, and methods of use thereof US Patent  US9175331 Publication Date 11/3/2015 
Target
Name:
Histone-lysine N-methyltransferase EZH2 [A687V]
Synonyms:
EZH2 Histone-lysine N-methyltransferase EZH2 (A687V) | KMT6
Type:
Protein
Mol. Mass.:
85395.90
Organism:
Homo sapiens (Human)
Description:
Q15910[A687V]
Residue:
746
  
Inhibitor
Name:
BDBM190207
Synonyms:
EPZ008496 | US9175331, 39
Type:
Small organic molecule
Emp. Form.:
C32H46N4O2
Mol. Mass.:
518.7332
SMILES:
CCN([C@H]1CC[C@@H](CC1)N(C)C)c1cc(cc(C(=O)NCc2c(C)cc(C)[nH]c2=O)c1C)C#CC(C)(C)C
: