Target
Histone-lysine N-methyltransferase EZH2 [A687V]
Ligand
BDBM172170
Substrate
Meas. Tech.
Inhibition Assay
IC50
7.5±n/a nM
Citation
 Kuntz, KWKnutson, SKWigle, TJ Inhibitors of human EZH2, and methods of use thereof US Patent  US9175331 Publication Date 11/3/2015 
Target
Name:
Histone-lysine N-methyltransferase EZH2 [A687V]
Synonyms:
EZH2 Histone-lysine N-methyltransferase EZH2 (A687V) | KMT6
Type:
Protein
Mol. Mass.:
85395.90
Organism:
Homo sapiens (Human)
Description:
Q15910[A687V]
Residue:
746
  
Inhibitor
Name:
BDBM172170
Synonyms:
EPZ008592 US11052093, Compound 178 US9175331, 41
Type:
Small organic molecule
Emp. Form.:
C33H41ClN4O4
Mol. Mass.:
593.156
SMILES:
CCN(C1CCOCC1)c1cc(cc(C(=O)NCc2c(C)cc(C)[nH]c2=O)c1Cl)-c1ccc(CN2CCOCC2)cc1
: