Target
Prostaglandin E2 receptor EP4 subtype
Ligand
BDBM190282
Substrate
Meas. Tech.
SEAP Activity Assay
Temperature
310.15±n/a K
EC50
0.063±n/a nM
Comments
extracted
Citation
 Barrett, SDCiske, FLColombo, JMEndres, GWGermain, BDKornilov, AKramer, JBUzieblo, AMaxey, KM Difluorolactam compounds as EP4 receptor-selective agonists for use in the treatment of EP4-mediated diseases and conditions US Patent  US9180116 Publication Date 11/10/2015 
Target
Name:
Prostaglandin E2 receptor EP4 subtype
Synonyms:
PE2R4_HUMAN PGE2 receptor EP4 subtype PTGER4 Prostanoid EP4 receptor
Type:
Enzyme
Mol. Mass.:
53134.53
Organism:
Homo sapiens (Human)
Description:
P35408
Residue:
488
  
Inhibitor
Name:
BDBM190282
Synonyms:
US9180116, 33C
Type:
Small organic molecule
Emp. Form.:
C20H27F2NO4S
Mol. Mass.:
415.494
SMILES:
CCCCC[C@H](O)\C=C\[C@H]1CC(F)(F)C(=O)N1CCCc1ccc(s1)C(O)=O
: