Target
Vasopressin V1a receptor
Ligand
BDBM288700
Substrate
Meas. Tech.
competition binding assay
Temperature
298.15±n/a K
Ki
15.8±n/a nM
Comments
extracted
Citation
 Dolente, CFasching, BRuntz-Schmitt, VSchnider, P Spiro-thiazolones US Patent  US10092551 Publication Date 10/9/2018 
Target
Name:
Vasopressin V1a receptor
Synonyms:
AVPR V1a AVPR1A V1AR_HUMAN VASOPRESSIN V1A Vasopressin V1 receptor Vasopressin receptor
Type:
Receptor
Mol. Mass.:
46820.18
Organism:
Homo sapiens (Human)
Description:
P37288
Residue:
418
  
Inhibitor
Name:
BDBM288700
Synonyms:
US10092551, Example 8
Type:
Small organic molecule
Emp. Form.:
C22H19ClN2O2S
Mol. Mass.:
410.916
SMILES:
Clc1ccc(\C=C2/SC(=NC2=O)N2CCC3(CC2)OCc2ccccc32)cc1
: