Target
Vasopressin V1a receptor
Ligand
BDBM288802
Substrate
Meas. Tech.
competition binding assay
Temperature
298.15±n/a K
Ki
25.1±n/a nM
Comments
extracted
Citation
 Dolente, CFasching, BRuntz-Schmitt, VSchnider, P Spiro-thiazolones US Patent  US10092551 Publication Date 10/9/2018 
Target
Name:
Vasopressin V1a receptor
Synonyms:
AVPR V1a AVPR1A V1AR_HUMAN VASOPRESSIN V1A Vasopressin V1 receptor Vasopressin receptor
Type:
Receptor
Mol. Mass.:
46820.18
Organism:
Homo sapiens (Human)
Description:
P37288
Residue:
418
  
Inhibitor
Name:
BDBM288802
Synonyms:
US10092551, Example 110
Type:
Small organic molecule
Emp. Form.:
C26H22N4O2S
Mol. Mass.:
454.543
SMILES:
O=[#6]1-[#7]=[#6](-[#16]\[#6]-1=[#6](\c1ccccn1)-c1ccccn1)-[#7]-1-[#6]-[#6]C2([#6]-[#6]-1)[#8]-[#6]-c1ccccc21
: