Target
Vasopressin V1a receptor
Ligand
BDBM288836
Substrate
Meas. Tech.
competition binding assay
Temperature
298.15±n/a K
Ki
10.0±n/a nM
Comments
extracted
Citation
 Dolente, CFasching, BRuntz-Schmitt, VSchnider, P Spiro-thiazolones US Patent  US10092551 Publication Date 10/9/2018 
Target
Name:
Vasopressin V1a receptor
Synonyms:
AVPR V1a AVPR1A V1AR_HUMAN VASOPRESSIN V1A Vasopressin V1 receptor Vasopressin receptor
Type:
Receptor
Mol. Mass.:
46820.18
Organism:
Homo sapiens (Human)
Description:
P37288
Residue:
418
  
Inhibitor
Name:
BDBM288836
Synonyms:
US10092551, Example 145
Type:
Small organic molecule
Emp. Form.:
C22H18ClN3O4S
Mol. Mass.:
455.914
SMILES:
OC\C(=C1\SC(=NC1=O)N1CCC2(CC1)OC(=O)c1ccccc21)c1ccc(Cl)nc1
: