Target
Vasopressin V1a receptor
Ligand
BDBM288837
Substrate
Meas. Tech.
competition binding assay
Temperature
298.15±n/a K
Ki
50.1±n/a nM
Comments
extracted
Citation
 Dolente, CFasching, BRuntz-Schmitt, VSchnider, P Spiro-thiazolones US Patent  US10092551 Publication Date 10/9/2018 
Target
Name:
Vasopressin V1a receptor
Synonyms:
AVPR V1a AVPR1A V1AR_HUMAN VASOPRESSIN V1A Vasopressin V1 receptor Vasopressin receptor
Type:
Receptor
Mol. Mass.:
46820.18
Organism:
Homo sapiens (Human)
Description:
P37288
Residue:
418
  
Inhibitor
Name:
BDBM288837
Synonyms:
US10092551, Example 146
Type:
Small organic molecule
Emp. Form.:
C28H32ClN3O4SSi
Mol. Mass.:
570.175
SMILES:
CC(C)(C)[Si](C)(C)OC\C(=C1/SC(=NC1=O)N1CCC2(CC1)OC(=O)c1ccccc21)c1ccc(Cl)nc1
: