Target
Vasopressin V1a receptor
Ligand
BDBM288708
Substrate
Meas. Tech.
competition binding assay
Temperature
298.15±n/a K
Ki
0.631±n/a nM
Comments
extracted
Citation
 Dolente, CFasching, BRuntz-Schmitt, VSchnider, P Spiro-thiazolones US Patent  US10092551 Publication Date 10/9/2018 
Target
Name:
Vasopressin V1a receptor
Synonyms:
AVPR V1a AVPR1A V1AR_HUMAN VASOPRESSIN V1A Vasopressin V1 receptor Vasopressin receptor
Type:
Receptor
Mol. Mass.:
46820.18
Organism:
Homo sapiens (Human)
Description:
P37288
Residue:
418
  
Inhibitor
Name:
BDBM288708
Synonyms:
US10092551, Example 151 | US10092551, Example 16
Type:
Small organic molecule
Emp. Form.:
C23H22N2O2S
Mol. Mass.:
390.498
SMILES:
C\C(=C1\SC(=NC1=O)N1CCC2(CC1)OCc1ccccc21)c1ccccc1
: