Target
Aurora kinase A
Ligand
BDBM155571
Substrate
Meas. Tech.
Aurora A Inhibition Assay
pH
7.4±n/a
Temperature
298.15±n/a K
IC50
0.900±n/a nM
Comments
extracted
Citation
 Sugimoto, TTakahashi, HMitsuya, MMasuko, NSootome, H Piperidine compound or salt thereof US Patent  US10092556 Publication Date 10/9/2018 
Target
Name:
Aurora kinase A
Synonyms:
AIK ARK-1 AURA AURKA_HUMAN Aurora 2 Aurora kinase A (AURKA) Aurora kinase A (Aurora-2) Aurora/IPL1-related kinase 1 Breast tumor-amplified kinase IAK1 STK15 GN Serine/threonine kinase 15 Serine/threonine-protein kinase 6 Serine/threonine-protein kinase aurora-A aurora-2 | hARK1
Type:
Serine/threonine-protein kinase
Mol. Mass.:
45830.98
Organism:
Homo sapiens (Human)
Description:
O14965
Residue:
403
  
Inhibitor
Name:
BDBM155571
Synonyms:
US10092556, Example 17 US9346787, 17
Type:
Small organic molecule
Emp. Form.:
C26H27ClF2N6O2
Mol. Mass.:
528.981
SMILES:
Cc1cc(Nc2nc(CC3(CCN(CC3)C(=O)c3cccc(Cl)c3F)C(=O)NC3CC3)ccc2F)n[nH]1
: