Target
Aurora kinase A
Ligand
BDBM155573
Substrate
Meas. Tech.
Aurora A Inhibition Assay
pH
7.4±n/a
Temperature
298.15±n/a K
IC50
0.700±n/a nM
Comments
extracted
Citation
 Sugimoto, TTakahashi, HMitsuya, MMasuko, NSootome, H Piperidine compound or salt thereof US Patent  US10092556 Publication Date 10/9/2018 
Target
Name:
Aurora kinase A
Synonyms:
AIK ARK1 AURKA AYK1 Aurora kinase A (AURA) Aurora kinase A (Aurora A) Aurora-related kinase 1 BTAK Breast-tumor-amplified kinase STK15 Serine/threonine kinase 15 Serine/threonine-protein kinase aurora A hARK1
Type:
Serine/threonine-protein kinase
Mol. Mass.:
45830.98
Organism:
Homo sapiens (Human)
Description:
O14965
Residue:
403
  
Inhibitor
Name:
BDBM155573
Synonyms:
US10092556, Example 22 US9346787, 22
Type:
Small organic molecule
Emp. Form.:
C25H24ClF2N7O2
Mol. Mass.:
527.954
SMILES:
Cc1cc(Nc2nc(CC3(CCN(CC3)C(=O)c3cccc(Cl)c3F)c3noc(C)n3)ccc2F)n[nH]1
: