Target
Enoyl-[acyl-carrier-protein] reductase [NADH] [T276S]
Ligand
BDBM50443007
Substrate
Meas. Tech.
Inhibition Kinetics
IC50
>1.00e+5±n/a nM
Citation
 Neckles, CPschibul, ALai, CTHirschbeck, MKuper, JDavoodi, SZou, JLiu, NPan, PShah, SDaryaee, FBommineni, GRLai, CSimmerling, CKisker, CTonge, PJ Selectivity of Pyridone- and Diphenyl Ether-Based Inhibitors for the Yersinia pestis FabV Enoyl-ACP Reductase. Biochemistry 55:2992-3006 (2016)  
Target
Name:
Enoyl-[acyl-carrier-protein] reductase [NADH] [T276S]
Synonyms:
Enoyl-ACP reductase T276S (T276S ypFabV) fabV
Type:
Protein
Mol. Mass.:
43321.97
Organism:
Yersinia pestis (Enterobacteria)
Description:
B1JRQ0[T276S]
Residue:
399
  
Inhibitor
Name:
BDBM50443007
Synonyms:
CHEMBL1236225 | PT70
Type:
Small organic molecule
Emp. Form.:
C19H24O2
Mol. Mass.:
284.3927
SMILES:
CCCCCCc1ccc(Oc2ccccc2C)c(O)c1
: