Target
Arachidonate 15-lipoxygenase
Ligand
BDBM50334150
Substrate
Meas. Tech.
LoxA HTP Assay
Temperature
298.15±n/a K
IC50
5.8e+3± 1.4e+3 nM
Comments
extracted
Citation
 Deschamps, JDOgunsola, AFJameson, JBYasgar, AFlitter, BAFreedman, CJMelvin, JANguyen, JVMaloney, DJJadhav, ASimeonov, ABomberger, JMHolman, TR Biochemical and Cellular Characterization and Inhibitor Discovery of Pseudomonas aeruginosa 15-Lipoxygenase. Biochemistry 55:3329-40 (2016)  
Target
Name:
Arachidonate 15-lipoxygenase
Synonyms:
15-Lipoxygenase (LoxA)
Type:
Protein
Mol. Mass.:
74804.41
Organism:
Pseudomonas aeruginosa
Description:
Residue:
685
  
Inhibitor
Name:
BDBM50334150
Synonyms:
1-(1-(4,4-bis(4-fluorophenyl)butyl)piperidin-4-yl)-1H-benzo[d]imidazol-2(3H)-one 1-(1-{3-[Bis-(4-fluoro-phenyl)-amino]-propyl}-piperidin-4-yl)-1,3-dihydro-benzoimidazol-2-one(Pimozide) 1-{1-[4,4-Bis-(4-fluoro-phenyl)-butyl]-piperidin-4-yl}-1,3-dihydro-benzoimidazol-2-one(Pimozide) MCN-JR-6238 NCGC00015802 PIMOZIDE1-{1-[4,4-BIS-(4-FLUORO-PHENYL)-BUTYL]-PIPERIDIN-4-YL}-1,3-DIHYDRO-BENZOIMIDAZOL-2-ONE R-6238
Type:
Small organic molecule
Emp. Form.:
C28H29F2N3O
Mol. Mass.:
461.5462
SMILES:
Fc1ccc(cc1)C(CCCN1CCC(CC1)n1c2ccccc2[nH]c1=O)c1ccc(F)cc1
: