Target
Isoform PNNOS of Nitric oxide synthase, brain (PNNOS) -973,I269V,M336V,D597N]
Ligand
BDBM190667
Substrate
Meas. Tech.
Hemoglobin Capture Assay
pH
7.4±n/a
Temperature
310.15±n/a K
Ki
65.3±0.0 nM
Comments
extracted
Citation
 Li, HWang, HYKang, SSilverman, RBPoulos, TL Electrostatic Control of Isoform Selective Inhibitor Binding in Nitric Oxide Synthase. Biochemistry 55:3702-7 (2016)  
Target
Name:
Isoform PNNOS of Nitric oxide synthase, brain (PNNOS) -973,I269V,M336V,D597N]
Synonyms:
Bnos Neuronal nitric oxide synthase mutant (D597N/M336V) Nitric oxide synthase, brain (PNNOS) [1-973,I269V,M336V,D597N] | Nos1
Type:
Protein
Mol. Mass.:
108435.83
Organism:
Rattus norvegicus (rats)
Description:
Rat neuronal nitric oxide synthase mutant M336V/D597N
Residue:
973
  
Inhibitor
Name:
BDBM190667
Synonyms:
US10759791, Compound 14j | nNOS inhibitor, 5
Type:
Small organic molecule
Emp. Form.:
C17H24N4
Mol. Mass.:
284.3993
SMILES:
CNCCCc1cncc(CCc2cc(C)cc(N)n2)c1
: