Target
Beta-secretase 1
Ligand
BDBM190714
Substrate
Meas. Tech.
HTRF FRET Assay
pH
5±n/a
Temperature
303.15±n/a K
Ki
2.7±n/a nM
Comments
extracted
Citation
 Wu, WBurnett, DAStamford, AWCumming, JNAsberom, TBennett, CSasiskumar, TKScott, JD 2-spiro-substituted iminothiazines and their mono-and dioxides as bace inhibitors, compositions and their use US Patent  US9181236 Publication Date 11/10/2015 
Target
Name:
Beta-secretase 1
Synonyms:
ASP2 Aspartyl protease 2 BACE1 Beta-secretase (BACE) Beta-secretase 1 (BACE 1) Beta-secretase 1 (BACE1) Beta-site amyloid precursor protein cleaving enzyme 1 Memapsin-2 beta-Secretase (BACE-1) | beta-Secretase (BACE1)
Type:
Protein
Mol. Mass.:
55755.10
Organism:
Homo sapiens (Human)
Description:
P56817
Residue:
501
  
Inhibitor
Name:
BDBM190714
Synonyms:
US9181236, 18
Type:
Small organic molecule
Emp. Form.:
C21H21Cl2FN4O3S
Mol. Mass.:
499.386
SMILES:
C[C@]1(CS(=O)(=O)C2(CCCC2)C(=N)N1)c1cc(NC(=O)c2ncc(Cl)cc2Cl)ccc1F
: