Target
G-protein coupled receptor 6
Ligand
BDBM190955
Substrate
Meas. Tech.
GPR6 In Vitro Assay (A.1)
Temperature
310.15±n/a K
IC50
0.0152±n/a nM
Comments
extracted
Citation
 Brown, JHitchcock, SHopkins, MKikuchi, SMonenschein, HReichard, HSchleicher, KSun, HMacklin, T Substituted pyrido[3,4-b]pyrazines as GPR6 modulators US Patent  US9181249 Publication Date 11/10/2015 
Target
Name:
G-protein coupled receptor 6
Synonyms:
G-protein coupled receptor 6 (GPR6) GPR6_HUMAN | Sphingosine 1-phosphate receptor GPR6
Type:
Protein
Mol. Mass.:
37886.39
Organism:
Homo sapiens (Human)
Description:
P46095
Residue:
362
  
Inhibitor
Name:
BDBM190955
Synonyms:
US10077266, Example 68 US9708313, 68
Type:
Small organic molecule
Emp. Form.:
C23H28F3N5
Mol. Mass.:
431.4971
SMILES:
CN1CCc2nc(NC3CC3)c(nc2C1)N1CCC(CC1)[C@H](F)c1ccc(F)cc1F
: