Target
G-protein coupled receptor 6
Ligand
BDBM190960
Substrate
Meas. Tech.
GPR6 In Vitro Assay (A.1)
Temperature
310.15±n/a K
IC50
0.0166±n/a nM
Comments
extracted
Citation
 Brown, JHitchcock, SHopkins, MKikuchi, SMonenschein, HReichard, HSchleicher, KSun, HMacklin, T Substituted pyrido[3,4-b]pyrazines as GPR6 modulators US Patent  US9181249 Publication Date 11/10/2015 
Target
Name:
G-protein coupled receptor 6
Synonyms:
G-protein coupled receptor 6 (GPR6) GPR6_HUMAN | Sphingosine 1-phosphate receptor GPR6
Type:
Protein
Mol. Mass.:
37886.39
Organism:
Homo sapiens (Human)
Description:
P46095
Residue:
362
  
Inhibitor
Name:
BDBM190960
Synonyms:
US10077266, Example 73 US9708313, 73
Type:
Small organic molecule
Emp. Form.:
C25H35FN6O3
Mol. Mass.:
486.5822
SMILES:
COc1ccc(OC2CCN(CC2)c2nc3CN(CCc3nc2NC(C)C)C(=O)N(C)C)c(F)c1
: