Target
G-protein coupled receptor 6
Ligand
BDBM191001
Substrate
Meas. Tech.
GPR6 In Vitro Assay (A.1)
Temperature
310.15±n/a K
IC50
0.0185±n/a nM
Comments
extracted
Citation
 Brown, JHitchcock, SHopkins, MKikuchi, SMonenschein, HReichard, HSchleicher, KSun, HMacklin, T Substituted pyrido[3,4-b]pyrazines as GPR6 modulators US Patent  US9181249 Publication Date 11/10/2015 
Target
Name:
G-protein coupled receptor 6
Synonyms:
G-protein coupled receptor 6 (GPR6) GPR6_HUMAN | Sphingosine 1-phosphate receptor GPR6
Type:
Protein
Mol. Mass.:
37886.39
Organism:
Homo sapiens (Human)
Description:
P46095
Residue:
362
  
Inhibitor
Name:
BDBM191001
Synonyms:
US10077266, Example 114 US9708313, 114
Type:
Small organic molecule
Emp. Form.:
C25H31F4N5O3
Mol. Mass.:
525.539
SMILES:
CO[C@H](C)C(=O)N1Cc2nc(N3CCC(CC3)Oc3ccc(F)cc3F)c(NCC(F)F)nc2CC1C
: