Target
G-protein coupled receptor 6
Ligand
BDBM191034
Substrate
Meas. Tech.
GPR6 In Vitro Assay (A.2)
IC50
0.3629±n/a nM
Citation
 Brown, JHitchcock, SHopkins, MKikuchi, SMonenschein, HReichard, HSchleicher, KSun, HMacklin, T Substituted pyrido[3,4-b]pyrazines as GPR6 modulators US Patent  US9181249 Publication Date 11/10/2015 
Target
Name:
G-protein coupled receptor 6
Synonyms:
G-protein coupled receptor 6 (GPR6) GPR6_HUMAN | Sphingosine 1-phosphate receptor GPR6
Type:
Protein
Mol. Mass.:
37886.39
Organism:
Homo sapiens (Human)
Description:
P46095
Residue:
362
  
Inhibitor
Name:
BDBM191034
Synonyms:
US10077266, Example 146 US9708313, 146
Type:
Small organic molecule
Emp. Form.:
C24H30FN7O
Mol. Mass.:
451.5397
SMILES:
CC(C)Nc1nc2CN(CCc2nc1N1CCN(Cc2ccc(cc2F)C#N)CC1)C(C)=O
: