Target
Phosphatidylinositol 3-kinase regulatory subunit beta
Ligand
BDBM288913
Substrate
Meas. Tech.
TR-FRET PIK3 Assay
pH
7.4±n/a
IC50
19000±n/a nM
Comments
extracted
Citation
 Cai, SDu, ZKaplan, JLoyer-Drew, JANaduthambi, DPhillips, BWPhillips, GVan Veldhuizen, JWatkins, WJYeung, SC Phosphatidylinositol 3-kinase inhibitors US Patent  US10092563 Publication Date 10/9/2018 
Target
Name:
Phosphatidylinositol 3-kinase regulatory subunit beta
Synonyms:
P85B_HUMAN PI3-kinase subunit p85-beta PIK3R2 PtdIns-3-kinase regulatory subunit beta | PtdIns-3-kinase regulatory subunit p85-beta
Type:
Enzyme Subunit
Mol. Mass.:
81542.75
Organism:
Homo sapiens (Human)
Description:
O00459
Residue:
728
  
Inhibitor
Name:
BDBM288913
Synonyms:
US10092563, Compound 49
Type:
Small organic molecule
Emp. Form.:
C19H18Cl2N8OS
Mol. Mass.:
477.37
SMILES:
C[C@H](Nc1ncnc2scnc12)c1nc2c(Cl)ccc(Cl)c2c(=O)n1N1CCNCC1
: