Target
Phosphatidylinositol 4,5-bisphosphate 3-kinase catalytic subunit delta isoform
Ligand
BDBM288913
Substrate
Meas. Tech.
TR-FRET PIK3 Assay
pH
7.4±n/a
IC50
2000±n/a nM
Comments
extracted
Citation
 Cai, SDu, ZKaplan, JLoyer-Drew, JANaduthambi, DPhillips, BWPhillips, GVan Veldhuizen, JWatkins, WJYeung, SC Phosphatidylinositol 3-kinase inhibitors US Patent  US10092563 Publication Date 10/9/2018 
Target
Name:
Phosphatidylinositol 4,5-bisphosphate 3-kinase catalytic subunit delta isoform
Synonyms:
PI3-kinase p110 subunit delta PI3-kinase subunit p110-delta PIK3CD Phosphatidylinositol 4,5-biphosphate 3-kinase catalytic subunit delta (PIK3CD) Phosphatidylinositol 4,5-bisphosphate 3-kinase 110 kDa catalytic subunit delta (PI3K delta) Phosphatidylinositol 4,5-bisphosphate 3-kinase catalytic subunit delta (PI3Kdelta) Phosphatidylinositol 4,5-bisphosphate 3-kinase catalytic subunit delta isoform (PI3K delta) Phosphatidylinositol 4,5-bisphosphate 3-kinase catalytic subunit delta isoform (PI3K-delta) Phosphatidylinositol 4,5-bisphosphate 3-kinase catalytic subunit delta isoform (PI3Kdelta)
Type:
Enzyme Subunit
Mol. Mass.:
119489.41
Organism:
Homo sapiens (Human)
Description:
O00329
Residue:
1044
  
Inhibitor
Name:
BDBM288913
Synonyms:
US10092563, Compound 49
Type:
Small organic molecule
Emp. Form.:
C19H18Cl2N8OS
Mol. Mass.:
477.37
SMILES:
C[C@H](Nc1ncnc2scnc12)c1nc2c(Cl)ccc(Cl)c2c(=O)n1N1CCNCC1
: