Target
Cytochrome P450 family 11 subfamily B member 2
Ligand
BDBM191238
Substrate
Meas. Tech.
Aldosterone Synthase Inhibition Assay
pH
7.4±n/a
IC50
9.1±n/a nM
Comments
extracted
Citation
 Balestra, MBurke, JChen, ZCogan, DFader, LGuo, XMcKibben, BMarshall, DRNemoto, PAYu, H Aldosterone synthase inhibitors US Patent  US9181272 Publication Date 11/10/2015 
Target
Name:
Cytochrome P450 family 11 subfamily B member 2
Synonyms:
Aldosterone Synthase (CYP11B2)
Type:
Mol. Mass.:
51334.55
Organism:
Cercopithecus sabaeus
Description:
Aldeosterone synthase (CYP11B2) from frozen cynomolgus monkey adrenal gland
Residue:
451
  
Inhibitor
Name:
BDBM191238
Synonyms:
US9181272, 8
Type:
Small organic molecule
Emp. Form.:
C13H12N4O2
Mol. Mass.:
256.26
SMILES:
NC(=O)N1CCOc2cc(cnc12)-c1cccnc1
: