Target
Cytochrome P450 family 11 subfamily B member 2
Ligand
BDBM191241
Substrate
Meas. Tech.
Aldosterone Synthase Inhibition Assay
pH
7.4±n/a
IC50
7.3±n/a nM
Comments
extracted
Citation
 Balestra, MBurke, JChen, ZCogan, DFader, LGuo, XMcKibben, BMarshall, DRNemoto, PAYu, H Aldosterone synthase inhibitors US Patent  US9181272 Publication Date 11/10/2015 
Target
Name:
Cytochrome P450 family 11 subfamily B member 2
Synonyms:
Aldosterone Synthase (CYP11B2)
Type:
Mol. Mass.:
51334.55
Organism:
Cercopithecus sabaeus
Description:
Aldeosterone synthase (CYP11B2) from frozen cynomolgus monkey adrenal gland
Residue:
451
  
Inhibitor
Name:
BDBM191241
Synonyms:
US9181272, 11
Type:
Small organic molecule
Emp. Form.:
C16H15N5O
Mol. Mass.:
293.3232
SMILES:
NC(=O)N1CCCc2cc(cnc12)-c1cncc(CC#N)c1
: