Target
Cytochrome P450 family 11 subfamily B member 2
Ligand
BDBM191262
Substrate
Meas. Tech.
Aldosterone Synthase Inhibition Assay
pH
7.4±n/a
IC50
13±n/a nM
Comments
extracted
Citation
 Balestra, MBurke, JChen, ZCogan, DFader, LGuo, XMcKibben, BMarshall, DRNemoto, PAYu, H Aldosterone synthase inhibitors US Patent  US9181272 Publication Date 11/10/2015 
Target
Name:
Cytochrome P450 family 11 subfamily B member 2
Synonyms:
Aldosterone Synthase (CYP11B2)
Type:
Mol. Mass.:
51334.55
Organism:
Cercopithecus sabaeus
Description:
Aldeosterone synthase (CYP11B2) from frozen cynomolgus monkey adrenal gland
Residue:
451
  
Inhibitor
Name:
BDBM191262
Synonyms:
US9181272, 32
Type:
Small organic molecule
Emp. Form.:
C18H18N6O
Mol. Mass.:
334.3751
SMILES:
Cn1cc(cn1)-c1cncc(c1)-c1cnc2N(CCCc2c1)C(N)=O
: