Target
Cytochrome P450 family 11 subfamily B member 2
Ligand
BDBM191521
Substrate
Meas. Tech.
Aldosterone Synthase Inhibition Assay
pH
7.4±n/a
IC50
17.5±n/a nM
Comments
extracted
Citation
 Balestra, MBurke, JChen, ZCogan, DFader, LGuo, XMcKibben, BMarshall, DRNemoto, PAYu, H Aldosterone synthase inhibitors US Patent  US9181272 Publication Date 11/10/2015 
Target
Name:
Cytochrome P450 family 11 subfamily B member 2
Synonyms:
Aldosterone Synthase (CYP11B2)
Type:
Mol. Mass.:
51334.55
Organism:
Cercopithecus sabaeus
Description:
Aldeosterone synthase (CYP11B2) from frozen cynomolgus monkey adrenal gland
Residue:
451
  
Inhibitor
Name:
BDBM191521
Synonyms:
US9181272, 291
Type:
Small organic molecule
Emp. Form.:
C14H14N4O2
Mol. Mass.:
270.2866
SMILES:
NC(=O)N1CCc2cc(cnc12)-c1cncc(CO)c1
: