Target
Casein kinase I isoform alpha
Ligand
BDBM6644
Substrate
Meas. Tech.
Radiometric-Based Assay (CK1α)
IC50
3.68e+4± 5.6e+3 nM
Citation
 Ursu, AIllich, DJTakemoto, YPorfetye, ATZhang, MBrockmeyer, AJanning, PWatanabe, NOsada, HVetter, IRZiegler, SSchöler, HRWaldmann, H Epiblastin A Induces Reprogramming of Epiblast Stem Cells Into Embryonic Stem Cells by Inhibition of Casein Kinase 1. Cell Chem Biol 23:494-507 (2016)  
Target
Name:
Casein kinase I isoform alpha
Synonyms:
CK1 CSNK1A1 Casein kinase 1 alpha (CK1 alpha) KC1A_HUMAN
Type:
Serine/threonine-protein kinase
Mol. Mass.:
38936.59
Organism:
Homo sapiens (Human)
Description:
P48729
Residue:
337
  
Inhibitor
Name:
BDBM6644
Synonyms:
6‐phenylpteridine‐2,4,7‐triamine (5) Pteridine deriv. 11 | TRIAMTERENE
Type:
Small organic molecule
Emp. Form.:
C12H11N7
Mol. Mass.:
253.2626
SMILES:
Nc1nc(N)c2nc(c(N)nc2n1)-c1ccccc1
: