Target
Lysine-specific demethylase 5C [1-789]
Ligand
BDBM191602
Substrate
Meas. Tech.
Formaldehyde Dehydrogenase-Coupled Demethylase (FDH) Assay
Temperature
298.15±n/a K
IC50
1.9e+4± 4e+3 nM
Comments
extracted
Citation
 Horton, JRLiu, XGale, MWu, LShanks, JRZhang, XWebber, PJBell, JSKales, SCMott, BTRai, GJansen, DJHenderson, MJUrban, DJHall, MDSimeonov, AMaloney, DJJohns, MAFu, HJadhav, AVertino, PMYan, QCheng, X Structural Basis for KDM5A Histone Lysine Demethylase Inhibition by Diverse Compounds. Cell Chem Biol 23:769-81 (2016)  
Target
Name:
Lysine-specific demethylase 5C [1-789]
Synonyms:
DXS1272E KDM5C Lysine-specific demethylase 5C (KDM5C(aa 1-789)-AP) XE169
Type:
Protein
Mol. Mass.:
90972.72
Organism:
Homo sapiens (Human)
Description:
Truncation 1-789 aa. Contains deletion of ARID and PhD1 domains.
Residue:
789
  
Inhibitor
Name:
BDBM191602
Synonyms:
3-((1-methyl-1Hpyrrolo[2,3-b]pyridin-3-yl)amino)isonicotinic acid (N12) US10336727, Example 52 | US9617242, Example 52
Type:
Small organic molecule
Emp. Form.:
C14H12N4O2
Mol. Mass.:
268.2707
SMILES:
Cn1cc(Nc2cnccc2C(O)=O)c2cccnc12
: