Target
Lysine-specific demethylase 5C [1-789]
Ligand
BDBM191604
Substrate
Meas. Tech.
Formaldehyde Dehydrogenase-Coupled Demethylase (FDH) Assay
Temperature
298.15±n/a K
IC50
>2.20e+5±n/a nM
Comments
extracted
Citation
 Horton, JRLiu, XGale, MWu, LShanks, JRZhang, XWebber, PJBell, JSKales, SCMott, BTRai, GJansen, DJHenderson, MJUrban, DJHall, MDSimeonov, AMaloney, DJJohns, MAFu, HJadhav, AVertino, PMYan, QCheng, X Structural Basis for KDM5A Histone Lysine Demethylase Inhibition by Diverse Compounds. Cell Chem Biol 23:769-81 (2016)  
Target
Name:
Lysine-specific demethylase 5C [1-789]
Synonyms:
DXS1272E KDM5C Lysine-specific demethylase 5C (KDM5C(aa 1-789)-AP) XE169
Type:
Protein
Mol. Mass.:
90972.72
Organism:
Homo sapiens (Human)
Description:
Truncation 1-789 aa. Contains deletion of ARID and PhD1 domains.
Residue:
789
  
Inhibitor
Name:
BDBM191604
Synonyms:
8-(1-methyl-1Himidazol-4-yl)-2-(4,4,4-trifluorobutoxy)pyrido[3,4-d]pyrimidin-4-ol (N10)
Type:
Small organic molecule
Emp. Form.:
C15H14F3N5O2
Mol. Mass.:
353.2992
SMILES:
Cn1cnc(c1)-c1nccc2c(O)nc(OCCCC(F)(F)F)nc12
: