Target
Lysine-specific demethylase 5D [1-760]
Ligand
BDBM191604
Substrate
Meas. Tech.
Formaldehyde Dehydrogenase-Coupled Demethylase (FDH) Assay
Temperature
298.15±n/a K
IC50
>2.00e+5±n/a nM
Comments
extracted
Citation
 Horton, JRLiu, XGale, MWu, LShanks, JRZhang, XWebber, PJBell, JSKales, SCMott, BTRai, GJansen, DJHenderson, MJUrban, DJHall, MDSimeonov, AMaloney, DJJohns, MAFu, HJadhav, AVertino, PMYan, QCheng, X Structural Basis for KDM5A Histone Lysine Demethylase Inhibition by Diverse Compounds. Cell Chem Biol 23:769-81 (2016)  
Target
Name:
Lysine-specific demethylase 5D [1-760]
Synonyms:
HY JARID1D KDM5D_HUMAN Lysine-specific demethylase 5D (KDM5D(aa 1-760)-AP) | SMCY
Type:
Protein
Mol. Mass.:
87351.60
Organism:
Homo sapiens (Human)
Description:
Truncation 1-760 aa. Contains deletion of ARID and PhD1 domains.
Residue:
760
  
Inhibitor
Name:
BDBM191604
Synonyms:
8-(1-methyl-1Himidazol-4-yl)-2-(4,4,4-trifluorobutoxy)pyrido[3,4-d]pyrimidin-4-ol (N10)
Type:
Small organic molecule
Emp. Form.:
C15H14F3N5O2
Mol. Mass.:
353.2992
SMILES:
Cn1cnc(c1)-c1nccc2c(O)nc(OCCCC(F)(F)F)nc12
: