Target
Lysine-specific demethylase 5A [1-588]
Ligand
BDBM50396019
Substrate
Meas. Tech.
Isothermal Titration Calorimetry (ITC)
Kd
1.2e+3± 2e+2 nM
Citation
 Horton, JRLiu, XGale, MWu, LShanks, JRZhang, XWebber, PJBell, JSKales, SCMott, BTRai, GJansen, DJHenderson, MJUrban, DJHall, MDSimeonov, AMaloney, DJJohns, MAFu, HJadhav, AVertino, PMYan, QCheng, X Structural Basis for KDM5A Histone Lysine Demethylase Inhibition by Diverse Compounds. Cell Chem Biol 23:769-81 (2016)  
Target
Name:
Lysine-specific demethylase 5A [1-588]
Synonyms:
JARID1A KDM5A_HUMAN RBBP2 | RBP2
Type:
Protein
Mol. Mass.:
66955.44
Organism:
Homo sapiens (Human)
Description:
Truncation 1-588 aa. Contains deletion of ARID and PhD1 domains.
Residue:
588
  
Inhibitor
Name:
BDBM50396019
Synonyms:
4'-(phenethylcarbamoyl)-[2,2'-bipyridine]-4-carboxylic acid (N3) | CHEMBL2169917
Type:
Small organic molecule
Emp. Form.:
C20H17N3O3
Mol. Mass.:
347.3673
SMILES:
OC(=O)c1ccnc(c1)-c1cc(ccn1)C(=O)NCCc1ccccc1
: