Target
Lysine-specific demethylase 5B [1-604]
Ligand
BDBM191600
Substrate
Meas. Tech.
Isothermal Titration Calorimetry (ITC)
Kd
7e+1± 2e+1 nM
Citation
 Horton, JRLiu, XGale, MWu, LShanks, JRZhang, XWebber, PJBell, JSKales, SCMott, BTRai, GJansen, DJHenderson, MJUrban, DJHall, MDSimeonov, AMaloney, DJJohns, MAFu, HJadhav, AVertino, PMYan, QCheng, X Structural Basis for KDM5A Histone Lysine Demethylase Inhibition by Diverse Compounds. Cell Chem Biol 23:769-81 (2016)  
Target
Name:
Lysine-specific demethylase 5B [1-604]
Synonyms:
JARID1B KDM5B_HUMAN PLU1 | RBBP2H1
Type:
Protein
Mol. Mass.:
68980.13
Organism:
Homo sapiens (Human)
Description:
Truncation 1-604 aa. Contains deletion of ARID and PhD1 domains.
Residue:
604
  
Inhibitor
Name:
BDBM191600
Synonyms:
2-(5-((4-chloro-2-methylbenzyl)oxy)-1Hpyrazol-1-yl)isonicotinic acid (N19) US9604961, Example 89 US9908865, Example 89
Type:
Small organic molecule
Emp. Form.:
C17H14ClN3O3
Mol. Mass.:
343.764
SMILES:
Cc1cc(Cl)ccc1COc1ccnn1-c1cc(ccn1)C(O)=O
: