Target
Lysine-specific demethylase 5A [1-1090]
Ligand
BDBM191603
Substrate
Meas. Tech.
AlphaLISA Assay
pH
7.2±n/a
Temperature
298.15±n/a K
IC50
1.8e+3± 1e+2 nM
Comments
extracted
Citation
 Horton, JRLiu, XGale, MWu, LShanks, JRZhang, XWebber, PJBell, JSKales, SCMott, BTRai, GJansen, DJHenderson, MJUrban, DJHall, MDSimeonov, AMaloney, DJJohns, MAFu, HJadhav, AVertino, PMYan, QCheng, X Structural Basis for KDM5A Histone Lysine Demethylase Inhibition by Diverse Compounds. Cell Chem Biol 23:769-81 (2016)  
Target
Name:
Lysine-specific demethylase 5A [1-1090]
Synonyms:
JARID1A KDM5A_HUMAN Lysine-specific demethylase 5A (KDM5Flag-KDM5A-FL) RBP2
Type:
Protein
Mol. Mass.:
124246.30
Organism:
Homo sapiens (Human)
Description:
Truncation 1-1090aa
Residue:
1090
  
Inhibitor
Name:
BDBM191603
Synonyms:
methyl 4'-(phenethylcarbamoyl)-[2,2'-bipyridine]-4-carboxylate (N4)
Type:
Small organic molecule
Emp. Form.:
C21H19N3O3
Mol. Mass.:
361.3939
SMILES:
COC(=O)c1ccnc(c1)-c1cc(ccn1)C(=O)NCCc1ccccc1
: