Target
Lysine-specific demethylase 5A [1-1090]
Ligand
BDBM191598
Substrate
Meas. Tech.
AlphaScreen Assay
IC50
40±10 nM
Citation
 Horton, JRLiu, XGale, MWu, LShanks, JRZhang, XWebber, PJBell, JSKales, SCMott, BTRai, GJansen, DJHenderson, MJUrban, DJHall, MDSimeonov, AMaloney, DJJohns, MAFu, HJadhav, AVertino, PMYan, QCheng, X Structural Basis for KDM5A Histone Lysine Demethylase Inhibition by Diverse Compounds. Cell Chem Biol 23:769-81 (2016)  
Target
Name:
Lysine-specific demethylase 5A [1-1090]
Synonyms:
JARID1A KDM5A_HUMAN Lysine-specific demethylase 5A (KDM5Flag-KDM5A-FL) RBP2
Type:
Protein
Mol. Mass.:
124246.30
Organism:
Homo sapiens (Human)
Description:
Truncation 1-1090aa
Residue:
1090
  
Inhibitor
Name:
BDBM191598
Synonyms:
2-(((2-((2-(dimethylamino)ethyl)(ethyl)amino)-2-oxoethyl)amino)methyl)isonicotinic acid (KDM5-C49) KDOAM-20
Type:
Small organic molecule
Emp. Form.:
C15H24N4O3
Mol. Mass.:
308.3761
SMILES:
CCN(CCN(C)C)C(=O)CNCc1cc(ccn1)C(O)=O
: