Target
Trypsin
Ligand
BDBM191639
Substrate
Meas. Tech.
High-Throughput Screening Assay
IC50
3500±670 nM
Citation
 Vasioukhin, VIChevillet, JR Hepsin inhibitors US Patent  US9182402 Publication Date 11/10/2015 
Target
Name:
Trypsin
Synonyms:
TRYP_PIG
Type:
PROTEIN
Mol. Mass.:
24411.24
Organism:
Sus scrofa
Description:
ChEMBL_1450738
Residue:
231
  
Inhibitor
Name:
BDBM191639
Synonyms:
US9182402, 12
Type:
Small organic molecule
Emp. Form.:
C24H15N3O6
Mol. Mass.:
441.3924
SMILES:
Oc1cc(NC(=O)c2ccc(o2)-c2cccc(c2)[N+]([O-])=O)ccc1-c1nc2ccccc2o1
: