Target
Histone deacetylase 3
Ligand
BDBM191640
Substrate
Meas. Tech.
Inhibition Assay
IC50
>10000±n/a nM
Citation
 Yun, ZWang, H Quinolyl-containing hydroxamic acid compound and preparation method thereof, and pharmaceutical composition containing this compound and use thereof US Patent  US9186318 Publication Date 11/17/2015 
Target
Name:
Histone deacetylase 3
Synonyms:
HD3 HDAC3_HUMAN Human HDAC3 SMAP45
Type:
Enzyme
Mol. Mass.:
48829.55
Organism:
Homo sapiens (Human)
Description:
O15379
Residue:
428
  
Inhibitor
Name:
BDBM191640
Synonyms:
US9186318, 9
Type:
Small organic molecule
Emp. Form.:
C31H28F2N4O7
Mol. Mass.:
606.5734
SMILES:
COc1cc2c(Oc3ccc(NC(=O)C4(CC4)C(=O)Nc4ccc(F)cc4)cc3F)ccnc2cc1OCCCC(=O)NO
: