Target
Histone deacetylase 9
Ligand
BDBM191641
Substrate
Meas. Tech.
Inhibition Assay
IC50
>10000±n/a nM
Citation
 Yun, ZWang, H Quinolyl-containing hydroxamic acid compound and preparation method thereof, and pharmaceutical composition containing this compound and use thereof US Patent  US9186318 Publication Date 11/17/2015 
Target
Name:
Histone deacetylase 9
Synonyms:
HD9 HDAC7B HDAC9_HUMAN Histone acetylase 9 (HDAC9) Histone deacetylase 9 (HDAC9) Human HDAC9 MITR
Type:
Enzyme
Mol. Mass.:
111304.31
Organism:
Homo sapiens (Human)
Description:
Q9UKV0
Residue:
1011
  
Inhibitor
Name:
BDBM191641
Synonyms:
US9186318, 13
Type:
Small organic molecule
Emp. Form.:
C33H32F2N4O7
Mol. Mass.:
634.6266
SMILES:
COc1cc2c(Oc3ccc(NC(=O)C4(CC4)C(=O)Nc4ccc(F)cc4)cc3F)ccnc2cc1OCCCCCC(=O)NO
: