Target
Transient receptor potential cation channel subfamily A member 1
Ligand
BDBM191697
Substrate
Meas. Tech.
Radiometric Calcium Assay
Temperature
298.15±n/a K
IC50
11.04±n/a nM
Comments
extracted
Citation
 Khairatkar-Joshi, NKulkarni, AMukhopadhyay, IKattige, VGBhosale, VMWale, DPThomas, AKumar, SChaudhari, SS Treatment of respiratory disorders using TRPA1 antagonists US Patent  US9186360 Publication Date 11/17/2015 
Target
Name:
Transient receptor potential cation channel subfamily A member 1
Synonyms:
ANKTM1 TRPA1 Transformation-sensitive protein p120 | Transient receptor potential cation channel subfamily A member 1 (TRPA1)
Type:
Protein
Mol. Mass.:
127514.20
Organism:
Homo sapiens (Human)
Description:
O75762
Residue:
1119
  
Inhibitor
Name:
BDBM191697
Synonyms:
US9186360, 41
Type:
Small organic molecule
Emp. Form.:
C20H16F4N6O4S
Mol. Mass.:
512.437
SMILES:
Cn1nc2n(C)c(=O)n(C)c(=O)c2c1CC(=O)Nc1nc(cs1)-c1ccc(OC(F)(F)F)c(F)c1
: