Target
Transient receptor potential cation channel subfamily V member 4
Ligand
BDBM191684
Substrate
Meas. Tech.
Radiometric Calcium Assay
Temperature
303.15±n/a K
IC50
>1000±n/a nM
Comments
extracted
Citation
 Khairatkar-Joshi, NKulkarni, AMukhopadhyay, IKattige, VGBhosale, VMWale, DPThomas, AKumar, SChaudhari, SS Treatment of respiratory disorders using TRPA1 antagonists US Patent  US9186360 Publication Date 11/17/2015 
Target
Name:
Transient receptor potential cation channel subfamily V member 4
Synonyms:
TRPV4 Transient receptor potential cation channel subfamily V member 4 (TRPV4) VROAC
Type:
Enzyme
Mol. Mass.:
98290.10
Organism:
Homo sapiens (Human)
Description:
Q9HBA0
Residue:
871
  
Inhibitor
Name:
BDBM191684
Synonyms:
US9186360, 23
Type:
Small organic molecule
Emp. Form.:
C25H26N4O4S
Mol. Mass.:
478.563
SMILES:
CC(C)COc1ccc(cc1)-c1csc(NC(=O)Cc2cccc3n(C)c(=O)n(C)c(=O)c23)n1
: