Target
Nuclear factor NF-kappa-B p105 subunit
Ligand
BDBM191750
Substrate
Meas. Tech.
Cellular Firefly Luciferase Assay (NFkB)
IC50
7600±n/a nM
Citation
 Vander Jagt, DLDeck, LMAbcouwer, SFOrlando, RARoyer, REWeber, WMBobrovnikova-Marjon, EVHunsaker, LA Therapeutic curcumin derivatives US Patent  US9187397 Publication Date 11/17/2015 
Target
Name:
Nuclear factor NF-kappa-B p105 subunit
Synonyms:
NFKB1 Nuclear factor NF-kappa-B (NF-kB) Nuclear factor NF-kappa-B p105 subunit
Type:
Protein
Mol. Mass.:
105329.57
Organism:
Homo sapiens (Human)
Description:
P19838
Residue:
968
  
Inhibitor
Name:
BDBM191750
Synonyms:
US9187397, 9a
Type:
Small organic molecule
Emp. Form.:
C28H26O6
Mol. Mass.:
458.5024
SMILES:
COc1cc(\C=C\C(\O)=C(/Cc2ccccc2)C(=O)\C=C\c2ccc(O)c(OC)c2)ccc1O
: