Target
Adenosine receptor A2b
Ligand
BDBM191871
Substrate
Meas. Tech.
Luciferase Assay
pH
7.4±n/a
Temperature
310.15±n/a K
EC50
3000±n/a nM
Comments
extracted
Citation
 Vakalopoulos, AMeibom, DNell, PSussmeier, FAlbrecht-Kupper, BZimmermann, KKeldenich, JSchneider, DKrenz, U Substituted dicyanopyridines and use thereof US Patent  US9187428 Publication Date 11/17/2015 
Target
Name:
Adenosine receptor A2b
Synonyms:
AA2BR_HUMAN ADORA2B Adenosine receptors A2b | Adenosine receptors; A2a & A2b
Type:
G Protein-Coupled Receptor (GPCR)
Mol. Mass.:
36341.22
Organism:
Homo sapiens (Human)
Description:
Residue:
332
  
Inhibitor
Name:
BDBM191871
Synonyms:
US9187428, 99
Type:
Small organic molecule
Emp. Form.:
C24H21N5O3S
Mol. Mass.:
459.52
SMILES:
NC(=O)c1cccc(CSc2nc(NC[C@@H](O)CO)c(C#N)c(-c3ccccc3)c2C#N)c1
: