Target
Cytochrome P450 11B1, mitochondrial
Ligand
BDBM191883
Substrate
Meas. Tech.
Cellular Enzyme Assay
EC50
4187±n/a nM
Citation
 Aebi, JAmrein, KHornsperger, BKuhn, BLiu, YMaerki, HPMartin, REMayweg, AVMohr, PTan, X Phenyl-tetrahydroisoquinoline derivatives US Patent  US9187429 Publication Date 11/17/2015 
Target
Name:
Cytochrome P450 11B1, mitochondrial
Synonyms:
C11B1_HUMAN CYPXIB1 Cytochrome P450 11B1 Cytochrome P450 11B1, mitochondrial | S11BH
Type:
Enzyme
Mol. Mass.:
57591.44
Organism:
Homo sapiens (Human)
Description:
P15538
Residue:
503
  
Inhibitor
Name:
BDBM191883
Synonyms:
US9187429, 9
Type:
Small organic molecule
Emp. Form.:
C20H21N3O
Mol. Mass.:
319.4002
SMILES:
CC(C)C(=O)NC1CCCc2c1cncc2-c1ccc(cc1)C#N
: