Target
Cytochrome P450 11B1, mitochondrial
Ligand
BDBM191888
Substrate
Meas. Tech.
Cellular Enzyme Assay
EC50
488±n/a nM
Citation
 Aebi, JAmrein, KHornsperger, BKuhn, BLiu, YMaerki, HPMartin, REMayweg, AVMohr, PTan, X Phenyl-tetrahydroisoquinoline derivatives US Patent  US9187429 Publication Date 11/17/2015 
Target
Name:
Cytochrome P450 11B1, mitochondrial
Synonyms:
C11B1_HUMAN CYPXIB1 Cytochrome P450 11B1 Cytochrome P450 11B1, mitochondrial | S11BH
Type:
Enzyme
Mol. Mass.:
57591.44
Organism:
Homo sapiens (Human)
Description:
P15538
Residue:
503
  
Inhibitor
Name:
BDBM191888
Synonyms:
US9187429, 14 US9187429, 16
Type:
Small organic molecule
Emp. Form.:
C24H22N2O
Mol. Mass.:
354.4443
SMILES:
Cc1ccc(cc1C)C1(O)CCCc2c(cncc12)-c1ccc(cc1)C#N
: