Target
Cytochrome b
Ligand
BDBM192112
Substrate
Meas. Tech.
Cytochrome b Enzyme Assay
pH
7.4±n/a
Temperature
298.15±n/a K
IC50
2134±n/a nM
Comments
extracted
Citation
 Vincent, BMLanglois, JBSrinivas, RLancaster, AKScherz-Shouval, RWhitesell, LTidor, BBuchwald, SLLindquist, S A Fungal-Selective Cytochrome bc1 Inhibitor Impairs Virulence and Prevents the Evolution of Drug Resistance. Cell Chem Biol 23:978-991 (2016)  
Target
Name:
Cytochrome b
Synonyms:
Type:
Protein
Mol. Mass.:
43717.83
Organism:
Candida albicans (Yeast)
Description:
Residue:
387
  
Inhibitor
Name:
BDBM192112
Synonyms:
Inz-103
Type:
Small organic molecule
Emp. Form.:
C20H15F4N5
Mol. Mass.:
401.3602
SMILES:
CNc1ccc2c(nn(Cc3cnccn3)c2c1)-c1cc(ccc1F)C(F)(F)F
: