Target
Cytochrome b
Ligand
BDBM192011
Substrate
Meas. Tech.
Cytochrome b Enzyme Assay
pH
7.4±n/a
Temperature
298.15±n/a K
IC50
4622±n/a nM
Comments
extracted
Citation
 Vincent, BMLanglois, JBSrinivas, RLancaster, AKScherz-Shouval, RWhitesell, LTidor, BBuchwald, SLLindquist, S A Fungal-Selective Cytochrome bc1 Inhibitor Impairs Virulence and Prevents the Evolution of Drug Resistance. Cell Chem Biol 23:978-991 (2016)  
Target
Name:
Cytochrome b
Synonyms:
COB CYTB MTCYB
Type:
Protein
Mol. Mass.:
42724.13
Organism:
Homo sapiens (Human)
Description:
Residue:
380
  
Inhibitor
Name:
BDBM192011
Synonyms:
Inz-2
Type:
Small organic molecule
Emp. Form.:
C17H12F4N2O2
Mol. Mass.:
352.283
SMILES:
COC(=O)Cn1nc(-c2cc(ccc2F)C(F)(F)F)c2ccccc12
: