Target
Cytochrome b
Ligand
BDBM192022
Substrate
Meas. Tech.
Cytochrome b Enzyme Assay
pH
7.4±n/a
Temperature
298.15±n/a K
IC50
>6.4e+4±n/a nM
Comments
extracted
Citation
 Vincent, BMLanglois, JBSrinivas, RLancaster, AKScherz-Shouval, RWhitesell, LTidor, BBuchwald, SLLindquist, S A Fungal-Selective Cytochrome bc1 Inhibitor Impairs Virulence and Prevents the Evolution of Drug Resistance. Cell Chem Biol 23:978-991 (2016)  
Target
Name:
Cytochrome b
Synonyms:
COB CYTB MTCYB
Type:
Protein
Mol. Mass.:
42724.13
Organism:
Homo sapiens (Human)
Description:
Residue:
380
  
Inhibitor
Name:
BDBM192022
Synonyms:
Inz-13
Type:
Small organic molecule
Emp. Form.:
C14H12N2O2S
Mol. Mass.:
272.322
SMILES:
COC(=O)Cn1nc(-c2ccsc2)c2ccccc12
: