Target
Cytochrome b
Ligand
BDBM192048
Substrate
Meas. Tech.
Cytochrome b Enzyme Assay
pH
7.4±n/a
Temperature
298.15±n/a K
IC50
1.078e+4±n/a nM
Comments
extracted
Citation
 Vincent, BMLanglois, JBSrinivas, RLancaster, AKScherz-Shouval, RWhitesell, LTidor, BBuchwald, SLLindquist, S A Fungal-Selective Cytochrome bc1 Inhibitor Impairs Virulence and Prevents the Evolution of Drug Resistance. Cell Chem Biol 23:978-991 (2016)  
Target
Name:
Cytochrome b
Synonyms:
COB CYTB MTCYB
Type:
Protein
Mol. Mass.:
42724.13
Organism:
Homo sapiens (Human)
Description:
Residue:
380
  
Inhibitor
Name:
BDBM192048
Synonyms:
Inz-39
Type:
Small organic molecule
Emp. Form.:
C19H11F5N4
Mol. Mass.:
390.3095
SMILES:
Fc1ccc(cc1-c1nn(Cc2cnccn2)c2c(F)cccc12)C(F)(F)F
: