Target
Cytochrome b
Ligand
BDBM192056
Substrate
Meas. Tech.
Cytochrome b Enzyme Assay
pH
7.4±n/a
Temperature
298.15±n/a K
IC50
>6.4e+4±n/a nM
Comments
extracted
Citation
 Vincent, BMLanglois, JBSrinivas, RLancaster, AKScherz-Shouval, RWhitesell, LTidor, BBuchwald, SLLindquist, S A Fungal-Selective Cytochrome bc1 Inhibitor Impairs Virulence and Prevents the Evolution of Drug Resistance. Cell Chem Biol 23:978-991 (2016)  
Target
Name:
Cytochrome b
Synonyms:
COB CYTB MTCYB
Type:
Protein
Mol. Mass.:
42724.13
Organism:
Homo sapiens (Human)
Description:
Residue:
380
  
Inhibitor
Name:
BDBM192056
Synonyms:
Inz-47
Type:
Small organic molecule
Emp. Form.:
C22H18N2O3
Mol. Mass.:
358.3899
SMILES:
OC(=O)Cn1nc(-c2cccc(OCc3ccccc3)c2)c2ccccc12
: