Target
Cytochrome b
Ligand
BDBM192091
Substrate
Meas. Tech.
Cytochrome b Enzyme Assay
pH
7.4±n/a
Temperature
298.15±n/a K
IC50
1.226e+4±n/a nM
Comments
extracted
Citation
 Vincent, BMLanglois, JBSrinivas, RLancaster, AKScherz-Shouval, RWhitesell, LTidor, BBuchwald, SLLindquist, S A Fungal-Selective Cytochrome bc1 Inhibitor Impairs Virulence and Prevents the Evolution of Drug Resistance. Cell Chem Biol 23:978-991 (2016)  
Target
Name:
Cytochrome b
Synonyms:
COB CYTB MTCYB
Type:
Protein
Mol. Mass.:
42724.13
Organism:
Homo sapiens (Human)
Description:
Residue:
380
  
Inhibitor
Name:
BDBM192091
Synonyms:
Inz-82
Type:
Small organic molecule
Emp. Form.:
C25H29FN6O
Mol. Mass.:
448.5358
SMILES:
Cn1nnc(Cn2nc(-c3cc(OCCCC4CCCCC4)ccc3F)c3ccccc23)n1
: