Target
E3 ubiquitin-protein ligase Mdm2
Ligand
BDBM192205
Substrate
Meas. Tech.
Fluorescence Polarization (FP) Assay
Temperature
293.15±n/a K
Ki
4.3±n/a nM
Comments
extracted
Citation
 Doemling, A p53-Mdm2 antagonists US Patent  US9187441 Publication Date 11/17/2015 
Target
Name:
E3 ubiquitin-protein ligase Mdm2
Synonyms:
Double minute 2 protein E3 ubiquitin-protein ligase Mdm2 (p53-binding protein Mdm2) Human Double Minute 2 (HDM2) MDM2-MDMX p53-Binding Protein MDM2 | p53-binding protein
Type:
Oncoprotein
Mol. Mass.:
55196.54
Organism:
Homo sapiens (Human)
Description:
Q00987
Residue:
491
  
Inhibitor
Name:
BDBM192205
Synonyms:
US9187441, 6N
Type:
Small organic molecule
Emp. Form.:
C25H25ClF3N3O4
Mol. Mass.:
523.932
SMILES:
CCOC(=O)c1[nH]c2cc(Cl)ccc2c1C(N(Cc1c(F)ccc(F)c1F)C=O)C(=O)NC(C)(C)C
: